{"text_format":"1","workbook":"xlsx","n_sheets":3,"sheets":["Dateneingabe","Abrechnung für Wohnungsnutzer","Haftungsausschluss"],"not_rendered":{"charts":0,"images":2,"macros":1,"external_links":0,"defined_names":13,"comments":0,"pivot_tables":0},"unopened":[],"bounds":{"document_bytes":16777216,"sheet_cells":100000,"rows_first":2000,"rows_last":500,"rows_between":2000,"halvings":0,"cell_chars":16384,"cell_head_chars":4096},"cells_cut":0,"cells_raw":0,"read":"whole","date_system":"1900"}

{"sheet":"Dateneingabe","index":0,"n_rows":897,"n_cols":27,"rows_kept":897,"cut":false,"hidden":false,"merged":[[896,3,896,15],[843,4,843,5],[844,4,844,5],[845,4,845,5],[846,4,846,5],[829,4,829,5],[830,4,830,5],[831,4,831,5],[832,4,832,5],[833,4,833,5],[834,4,834,5],[835,4,835,5],[836,4,836,5],[893,3,893,15],[892,3,892,15],[876,3,876,15],[875,3,875,15],[874,3,874,15],[885,3,885,15],[884,3,884,15],[880,3,880,15],[879,3,879,15],[878,3,878,15],[877,3,877,15],[3,18,4,21],[14,12,15,12],[14,6,15,6],[709,12,711,14],[396,2,550,2],[553,2,707,2],[711,2,863,2],[887,3,887,15],[881,3,881,15],[856,4,856,5],[857,4,857,5],[858,4,858,5],[847,4,847,5],[848,4,848,5],[849,4,849,5],[850,4,850,5],[851,4,851,5],[852,4,852,5],[853,4,853,5],[854,4,854,5],[855,4,855,5],[838,4,838,5],[824,4,824,5],[828,4,828,5],[890,3,890,15],[882,3,882,15],[889,3,889,15],[883,3,883,15],[888,3,888,15],[886,3,886,15],[837,4,837,5],[840,4,840,5],[841,4,841,5],[842,4,842,5],[839,4,839,5],[818,4,818,5],[819,4,819,5],[820,4,820,5],[821,4,821,5],[822,4,822,5],[823,4,823,5],[825,4,825,5],[826,4,826,5],[827,4,827,5],[809,4,809,5],[810,4,810,5],[811,4,811,5],[812,4,812,5],[813,4,813,5],[814,4,814,5],[815,4,815,5],[816,4,816,5],[817,4,817,5],[800,4,800,5],[801,4,801,5],[802,4,802,5],[803,4,803,5],[804,4,804,5],[805,4,805,5],[806,4,806,5],[807,4,807,5],[808,4,808,5],[791,4,791,5],[792,4,792,5],[793,4,793,5],[794,4,794,5],[795,4,795,5],[796,4,796,5],[797,4,797,5],[798,4,798,5],[799,4,799,5],[782,4,782,5],[783,4,783,5],[784,4,784,5],[785,4,785,5],[786,4,786,5],[787,4,787,5],[788,4,788,5],[789,4,789,5],[790,4,790,5],[773,4,773,5],[774,4,774,5],[775,4,775,5],[776,4,776,5],[777,4,777,5],[778,4,778,5],[779,4,779,5],[780,4,780,5],[781,4,781,5],[764,4,764,5],[765,4,765,5],[766,4,766,5],[767,4,767,5],[768,4,768,5],[769,4,769,5],[770,4,770,5],[771,4,771,5],[772,4,772,5],[755,4,755,5],[756,4,756,5],[757,4,757,5],[758,4,758,5],[759,4,759,5],[760,4,760,5],[761,4,761,5],[762,4,762,5],[763,4,763,5],[746,4,746,5],[747,4,747,5],[748,4,748,5],[749,4,749,5],[750,4,750,5],[751,4,751,5],[752,4,752,5],[753,4,753,5],[754,4,754,5],[737,4,737,5],[738,4,738,5],[739,4,739,5],[740,4,740,5],[741,4,741,5],[742,4,742,5],[743,4,743,5],[744,4,744,5],[745,4,745,5],[728,4,728,5],[729,4,729,5],[730,4,730,5],[731,4,731,5],[732,4,732,5],[733,4,733,5],[734,4,734,5],[735,4,735,5],[736,4,736,5],[705,4,705,5],[707,3,707,5],[706,4,706,5],[863,3,863,5],[862,4,862,5],[717,4,717,5],[716,4,716,5],[715,4,715,5],[714,4,714,5],[713,4,713,5],[712,4,712,5],[718,4,718,5],[719,4,719,5],[720,4,720,5],[721,4,721,5],[859,4,859,5],[860,4,860,5],[861,4,861,5],[722,4,722,5],[723,4,723,5],[724,4,724,5],[725,4,725,5],[726,4,726,5],[727,4,727,5],[696,4,696,5],[697,4,697,5],[698,4,698,5],[699,4,699,5],[700,4,700,5],[701,4,701,5],[702,4,702,5],[703,4,703,5],[704,4,704,5],[687,4,687,5],[688,4,688,5],[689,4,689,5],[690,4,690,5],[691,4,691,5],[692,4,692,5],[693,4,693,5],[694,4,694,5],[695,4,695,5],[678,4,678,5],[679,4,679,5],[680,4,680,5],[681,4,681,5],[682,4,682,5],[683,4,683,5],[684,4,684,5],[685,4,685,5],[686,4,686,5],[669,4,669,5],[670,4,670,5],[671,4,671,5],[672,4,672,5],[673,4,673,5],[674,4,674,5],[675,4,675,5],[676,4,676,5],[677,4,677,5],[660,4,660,5],[661,4,661,5],[662,4,662,5],[663,4,663,5],[664,4,664,5],[665,4,665,5],[666,4,666,5],[667,4,667,5],[668,4,668,5],[651,4,651,5],[652,4,652,5],[653,4,653,5],[654,4,654,5],[655,4,655,5],[656,4,656,5],[657,4,657,5],[658,4,658,5],[659,4,659,5],[642,4,642,5],[643,4,643,5],[644,4,644,5],[645,4,645,5],[646,4,646,5],[647,4,647,5],[648,4,648,5],[649,4,649,5],[650,4,650,5],[633,4,633,5],[634,4,634,5],[635,4,635,5],[636,4,636,5],[637,4,637,5],[638,4,638,5],[639,4,639,5],[640,4,640,5],[641,4,641,5],[624,4,624,5],[625,4,625,5],[626,4,626,5],[627,4,627,5],[628,4,628,5],[629,4,629,5],[630,4,630,5],[631,4,631,5],[632,4,632,5],[615,4,615,5],[616,4,616,5],[617,4,617,5],[618,4,618,5],[619,4,619,5],[620,4,620,5],[621,4,621,5],[622,4,622,5],[623,4,623,5],[606,4,606,5],[607,4,607,5],[608,4,608,5],[609,4,609,5],[610,4,610,5],[611,4,611,5],[612,4,612,5],[613,4,613,5],[614,4,614,5],[597,4,597,5],[598,4,598,5],[599,4,599,5],[600,4,600,5],[601,4,601,5],[602,4,602,5],[603,4,603,5],[604,4,604,5],[605,4,605,5],[588,4,588,5],[589,4,589,5],[590,4,590,5],[591,4,591,5],[592,4,592,5],[593,4,593,5],[594,4,594,5],[595,4,595,5],[596,4,596,5],[585,4,585,5],[586,4,586,5],[587,4,587,5],[581,4,581,5],[582,4,582,5],[583,4,583,5],[584,4,584,5],[560,4,560,5],[559,4,559,5],[566,4,566,5],[567,4,567,5],[564,4,564,5],[563,4,563,5],[562,4,562,5],[561,4,561,5],[578,4,578,5],[579,4,579,5],[580,4,580,5],[572,4,572,5],[576,4,576,5],[536,4,536,5],[537,4,537,5],[577,4,577,5],[555,13,556,13],[553,11,554,13],[555,9,556,9],[555,6,556,6],[555,7,556,7],[557,4,557,5],[555,4,556,5],[555,10,556,10],[555,8,556,8],[573,4,573,5],[574,4,574,5],[575,4,575,5],[558,4,558,5],[538,4,538,5],[539,4,539,5],[540,4,540,5],[541,4,541,5],[542,4,542,5],[543,4,543,5],[544,4,544,5],[545,4,545,5],[546,4,546,5],[550,3,550,5],[549,4,549,5],[548,4,548,5],[547,4,547,5],[568,4,568,5],[569,4,569,5],[570,4,570,5],[571,4,571,5],[553,3,554,10],[565,4,565,5],[555,3,556,3],[550,6,550,7],[527,4,527,5],[528,4,528,5],[529,4,529,5],[530,4,530,5],[531,4,531,5],[532,4,532,5],[533,4,533,5],[534,4,534,5],[535,4,535,5],[518,4,518,5],[519,4,519,5],[520,4,520,5],[521,4,521,5],[522,4,522,5],[523,4,523,5],[524,4,524,5],[525,4,525,5],[526,4,526,5],[509,4,509,5],[510,4,510,5],[511,4,511,5],[512,4,512,5],[513,4,513,5],[514,4,514,5],[515,4,515,5],[516,4,516,5],[517,4,517,5],[500,4,500,5],[501,4,501,5],[502,4,502,5],[503,4,503,5],[504,4,504,5],[505,4,505,5],[506,4,506,5],[507,4,507,5],[508,4,508,5],[491,4,491,5],[492,4,492,5],[493,4,493,5],[494,4,494,5],[495,4,495,5],[496,4,496,5],[497,4,497,5],[498,4,498,5],[499,4,499,5],[482,4,482,5],[483,4,483,5],[484,4,484,5],[485,4,485,5],[486,4,486,5],[487,4,487,5],[488,4,488,5],[489,4,489,5],[490,4,490,5],[473,4,473,5],[474,4,474,5],[475,4,475,5],[476,4,476,5],[477,4,477,5],[478,4,478,5],[479,4,479,5],[480,4,480,5],[481,4,481,5],[464,4,464,5],[465,4,465,5],[466,4,466,5],[467,4,467,5],[468,4,468,5],[469,4,469,5],[470,4,470,5],[471,4,471,5],[472,4,472,5],[455,4,455,5],[456,4,456,5],[457,4,457,5],[458,4,458,5],[459,4,459,5],[460,4,460,5],[461,4,461,5],[462,4,462,5],[463,4,463,5],[446,4,446,5],[447,4,447,5],[448,4,448,5],[449,4,449,5],[450,4,450,5],[451,4,451,5],[452,4,452,5],[453,4,453,5],[454,4,454,5],[443,4,443,5],[444,4,444,5],[445,4,445,5],[438,4,438,5],[427,4,427,5],[428,4,428,5],[429,4,429,5],[430,4,430,5],[431,4,431,5],[435,4,435,5],[436,4,436,5],[437,4,437,5],[439,4,439,5],[434,4,434,5],[440,4,440,5],[389,3,389,5],[388,3,388,5],[384,3,384,5],[383,3,383,5],[382,3,382,6],[385,3,385,5],[387,3,387,6],[441,4,441,5],[442,4,442,5],[414,4,414,5],[415,4,415,5],[408,4,408,5],[407,4,407,5],[406,4,406,5],[405,4,405,5],[403,4,403,5],[402,4,402,5],[401,4,401,5],[169,9,169,12],[169,4,170,4],[341,12,342,12],[338,4,338,5],[358,6,358,7],[341,8,342,8],[336,4,336,5],[341,9,342,9],[341,7,342,7],[334,2,334,7],[169,2,321,2],[169,3,170,3],[358,4,358,5],[337,4,337,5],[341,6,342,6],[169,5,169,8],[335,4,335,6],[341,4,342,4],[340,4,340,9],[340,3,358,3],[341,11,342,11],[331,4,332,4],[6,9,6,10],[9,12,9,13],[14,9,15,9],[6,7,7,7],[9,3,9,4],[7,9,7,10],[9,9,9,10],[13,1,13,15],[14,5,15,5],[14,3,15,3],[14,4,15,4],[14,2,166,2],[14,8,15,8],[166,3,166,5],[14,7,15,7],[14,11,15,11],[166,12,166,13],[14,13,15,13],[14,10,15,10],[6,3,6,6],[6,11,6,14],[7,11,7,14],[367,5,367,7],[380,3,380,5],[373,7,374,11],[379,3,379,5],[377,7,377,10],[381,7,381,10],[375,3,375,5],[376,3,376,5],[377,3,377,5],[378,3,378,5],[374,3,374,5],[3,2,4,6],[3,12,4,13],[891,3,891,15],[422,4,422,5],[423,4,423,5],[432,4,432,5],[433,4,433,5],[365,3,365,4],[367,3,367,4],[398,6,399,6],[398,4,399,5],[396,9,397,12],[398,7,399,7],[398,9,399,9],[416,4,416,5],[417,4,417,5],[418,4,418,5],[419,4,419,5],[420,4,420,5],[364,9,364,13],[386,12,386,13],[387,12,388,12],[387,13,388,13],[396,3,397,5],[895,3,895,15],[330,3,330,8],[331,7,331,8],[332,7,332,8],[331,3,332,3],[330,10,330,12],[333,10,333,11],[869,2,869,7],[865,3,865,11],[711,3,711,10],[398,3,399,3],[390,7,390,10],[424,4,424,5],[425,4,425,5],[426,4,426,5],[409,4,409,5],[410,4,410,5],[411,4,411,5],[412,4,412,5],[398,12,399,12],[400,4,400,5],[382,7,382,10],[385,7,385,10],[384,7,384,10],[398,8,399,8],[404,4,404,5],[421,4,421,5],[413,4,413,5],[400,13,401,15],[6,8,7,8],[396,6,397,8],[390,3,390,5],[370,3,370,6],[369,3,369,6],[368,3,368,7],[383,7,383,10],[388,7,388,10],[389,7,389,10],[387,7,387,10],[386,7,386,10],[364,3,364,6],[378,7,378,10],[379,7,379,10],[380,7,380,10],[376,7,376,10],[375,7,375,10],[366,3,366,4],[366,5,366,7]]}
[]
[null,"Achtung: Nur die hellgrau gefärbten Felder sind auszufüllen!"]
[]
[null,null,"Heizkostenabrechnung für Pelletheizungen",null,null,null,null,null,null,null,null,null,"Umlageverfahren",null,null,null,null,null,"Gradtagszahlen für Monate"]
[null,null,null,null,null,null,null,null,null,null,null,null,null,null,"Stand: 1/2024"]
[null,null,null,null,null,null,null,null,null,null,null,null,null,null,null,null,null,null,"Monat","Gradtagszahl","Monat","Gradtagszahl"]
[null,null,"Objekt1:",null,null,null,null,"Jahr3:",null,"Ersteller der Abrechnung4: ",null,null,null,null,null,null,null,null,"Januar",170,"Juli",{"$f":"40/3","v":13.333333333333334}]
[null,null,null,null,null,"Anzahl Tabellenzeilen2: ",5,null,null,"Datum5: ",null,null,null,null,null,null,null,null,"Februar",150,"August",{"$f":"40/3","v":13.333333333333334}]
[null,null,null,null,null,null,null,null,null,null,null,null,null,null,null,null,null,null,"März",130,"September",30]
[null,null,null,"Abrechnungszeitraum6: ",null,null,"bis",null,null,"Abrechnungszeitraum7: ",null,{"$f":"IF(OR(F10>H10,H10-F10>366),\"Fehler\",IF(F10<H10,(H10-F10+1),IF(F10=H10,\"\")))","v":""},"max. 365 Tage, Schaltjahr 366 Tage",null,null,null,null,null,"April",80,"Oktober",80]
[null,null,null,null,null,null,null,null,null,null,null,null,null,null,null,null,null,null,"Mai",40,"November",120]
[null,null,null,null,null,null,null,null,null,null,null,null,null,null,null,null,null,null,"Juni",{"$f":"40/3","v":13.333333333333334},"Dezember",160]
[]
[]
[null,null,"Tabelle 1","Wohneinheit8 \n(WE)","Nutzername8","Nutz- bzw. Wohnfläche in m²","Beginn des Nutzungszeitraums","Ende des Nutzungszeitraums","Nutzungs-\nzeitraum","Auszug des Nutzer","monatl. Zahlung Heizkosten (Soll)","Zahlungseingang \nfür den Ab-\nrechnungszeitraum","Anteilige Wohndauer","Anteilig über Gradtagszahlen-methode"]
{"$rows_left_out":883}
{"sheet":"Abrechnung für Wohnungsnutzer","index":1,"n_rows":72,"n_cols":82,"rows_kept":72,"cut":false,"hidden":false,"merged":[[43,10,44,11],[41,18,42,19],[46,10,46,11],[42,10,42,11],[51,10,51,11],[50,10,50,11],[49,10,49,11],[47,10,48,11],[51,8,51,9],[3,13,5,20],[3,1,5,11],[6,13,6,20],[18,17,18,20],[10,10,10,11],[12,18,12,20],[16,13,16,16],[37,13,37,16],[13,13,14,20],[15,18,15,20],[29,17,29,20],[25,17,25,20],[16,17,16,20],[14,3,14,5],[31,3,31,5],[6,1,6,11],[7,1,8,11],[16,1,18,6],[32,8,32,9],[12,8,12,11],[13,8,13,11],[14,8,14,11],[15,8,15,11],[34,1,34,11],[15,3,15,5],[47,8,48,8],[39,9,40,9],[39,8,40,8],[39,5,40,5],[39,6,40,7],[24,1,26,11],[43,4,44,5],[22,1,23,11],[30,1,30,11],[32,10,32,11],[32,1,32,2],[36,1,36,2],[35,1,35,2],[35,3,35,5],[35,6,35,7],[43,6,44,6],[43,7,44,8],[32,6,32,7],[36,6,36,7],[39,1,40,3],[38,9,38,10],[38,1,38,8],[42,1,42,3],[39,13,40,20],[41,13,42,16],[41,17,42,17],[41,20,42,20],[61,10,61,11],[16,8,16,11],[31,8,31,9],[35,8,35,9],[36,10,36,11],[39,10,40,11],[35,10,35,11],[53,10,53,11],[19,1,21,11],[31,10,31,11],[58,13,59,20],[50,1,51,7],[52,8,52,9],[52,1,52,7],[52,10,52,11],[58,1,59,11],[42,4,42,5],[46,1,46,3],[46,4,46,5],[55,1,57,11],[31,1,31,2],[36,8,36,9],[47,1,48,3],[53,8,53,9],[47,6,48,7],[47,9,48,9],[49,8,49,9],[50,8,50,9],[47,4,48,5],[43,1,44,3],[49,1,49,7],[31,6,31,7],[43,9,44,9],[17,17,17,19],[19,17,19,19],[20,17,20,19],[22,17,22,19],[23,17,23,19],[26,17,26,19],[21,17,21,19],[36,13,36,16],[34,17,34,20]]}
[]
[null,"Erst nach vollständiger Auswahl der Wohneinheit und des Wohnungsnutzers (Name) aktualisiert sich das nachfolgende Blatt!"]
[]
[null,{"$f":"\"Heizkostenabrechnung \"&Dateneingabe!I7","v":"Heizkostenabrechnung "},null,null,null,null,null,null,null,null,null,null,null,{"$f":"\"Heizkostenabrechnung \"&Dateneingabe!I7","v":"Heizkostenabrechnung "},null,null,null,null,null,null,null,null,null,null,null,null,null,null,null,null,null,null,null,null,null,null,null,null,null,null,null,null,null,null,null,null,null,null,null,null,null,null,null,null,null,null,null,null,null,null,null,null,null,null,null,null,null,null,null,null,null,null,null,null,null,null,null,null,null,null,null,{"$f":"IFERROR(INDEX(Dateneingabe!$E$17:$E$166,LARGE((Dateneingabe!$D$17:$D$166=$D$12)*(ROW(Dateneingabe!$D$17:$D$166)-16),COUNTIF(Dateneingabe!$D$17:$D$166,$D$12)+17-ROW(Dateneingabe!D17))),\"\")","v":""}]
[]
[null,null,null,null,null,null,null,null,null,null,null,null,null,null,null,null,null,null,null,null,null,null,null,null,null,null,null,null,null,null,null,null,null,null,null,null,null,null,null,null,null,null,null,null,null,null,null,null,null,null,null,null,null,null,null,null,null,null,null,null,null,null,null,null,null,null,null,null,null,null,null,null,null,null,null,null,null,null,null,null,null,{"$f":"IFERROR(INDEX(Dateneingabe!$E$17:$E$166,LARGE((Dateneingabe!$D$17:$D$166=$D$12)*(ROW(Dateneingabe!$D$17:$D$166)-16),COUNTIF(Dateneingabe!$D$17:$D$166,$D$12)+17-ROW(Dateneingabe!D18))),\"\")","v":""}]
[null,{"$f":"\"Abrechnungszeitraum \"&TEXT(Dateneingabe!F10,\"TT.MM.JJJJ\")&\" - \"&TEXT(Dateneingabe!H10,\"TT.MM.JJJJ\")","v":"Abrechnungszeitraum 00.01.1900 - 00.01.1900"},null,null,null,null,null,null,null,null,null,null,null,{"$f":"\"Abrechnungszeitraum \"&TEXT(Dateneingabe!F10,\"TT.MM.JJJJ\")&\" - \"&TEXT(Dateneingabe!H10,\"TT.MM.JJJJ\")","v":"Abrechnungszeitraum 00.01.1900 - 00.01.1900"},null,null,null,null,null,null,null,null,null,null,null,null,null,null,null,null,null,null,null,null,null,null,null,null,null,null,null,null,null,null,null,null,null,null,null,null,null,null,null,null,null,null,null,null,null,null,null,null,null,null,null,null,null,null,null,null,null,null,null,null,null,null,null,null,null,null,null,{"$f":"IFERROR(INDEX(Dateneingabe!$E$17:$E$166,LARGE((Dateneingabe!$D$17:$D$166=$D$12)*(ROW(Dateneingabe!$D$17:$D$166)-16),COUNTIF(Dateneingabe!$D$17:$D$166,$D$12)+17-ROW(Dateneingabe!D19))),\"\")","v":""}]
[null,"Kosten Ihrer Wohneinheit",null,null,null,null,null,null,null,null,null,null,null,null,null,null,null,null,null,null,null,null,null,null,null,null,null,null,null,null,null,null,null,null,null,null,null,null,null,null,null,null,null,null,null,null,null,null,null,null,null,null,null,null,null,null,null,null,null,null,null,null,null,null,null,null,null,null,null,null,null,null,null,null,null,null,null,null,null,null,null,{"$f":"IFERROR(INDEX(Dateneingabe!$E$17:$E$166,LARGE((Dateneingabe!$D$17:$D$166=$D$12)*(ROW(Dateneingabe!$D$17:$D$166)-16),COUNTIF(Dateneingabe!$D$17:$D$166,$D$12)+17-ROW(Dateneingabe!D20))),\"\")","v":""}]
[null,null,null,null,null,null,null,null,null,null,null,null,null,null,null,null,null,null,null,null,null,null,null,null,null,null,null,null,null,null,null,null,null,null,null,null,null,null,null,null,null,null,null,null,null,null,null,null,null,null,null,null,null,null,null,null,null,null,null,null,null,null,null,null,null,null,null,null,null,null,null,null,null,null,null,null,null,null,null,null,null,{"$f":"IFERROR(INDEX(Dateneingabe!$E$17:$E$166,LARGE((Dateneingabe!$D$17:$D$166=$D$12)*(ROW(Dateneingabe!$D$17:$D$166)-16),COUNTIF(Dateneingabe!$D$17:$D$166,$D$12)+17-ROW(Dateneingabe!D21))),\"\")","v":""}]
[null,null,null,null,null,null,null,null,null,null,null,null,null,null,null,null,null,null,null,null,null,null,null,null,null,null,null,null,null,null,null,null,null,null,null,null,null,null,null,null,null,null,null,null,null,null,null,null,null,null,null,null,null,null,null,null,null,null,null,null,null,null,null,null,null,null,null,null,null,null,null,null,null,null,null,null,null,null,null,null,null,{"$f":"IFERROR(INDEX(Dateneingabe!$E$17:$E$166,LARGE((Dateneingabe!$D$17:$D$166=$D$12)*(ROW(Dateneingabe!$D$17:$D$166)-16),COUNTIF(Dateneingabe!$D$17:$D$166,$D$12)+17-ROW(Dateneingabe!D22))),\"\")","v":""}]
[null,"Objekt:",null,{"$f":"IF(Dateneingabe!D7=\"\",\"\",Dateneingabe!D7)","v":""},null,null,null,null,null,null,{"$f":"IF(OR(Dateneingabe!L8<>0,Dateneingabe!L8<>\"\"),TEXT(Dateneingabe!L8,\"TT. MMM. JJJJ\"),\"\")","v":""},null,null,{"$f":"B11","v":"Objekt:"},{"$f":"D11","v":""},null,null,null,null,null,{"$f":"IF(OR(Dateneingabe!L8<>0,Dateneingabe!L8<>\"\"),TEXT(K11,\"TT. MMM. JJJJ\"),\"\")","v":""},null,null,null,null,null,null,null,null,null,null,null,null,null,null,null,null,null,null,null,null,null,null,null,null,null,null,null,null,null,null,null,null,null,null,null,null,null,null,null,null,null,null,null,null,null,null,null,null,null,null,null,null,null,null,null,null,null,null,null,null,{"$f":"IFERROR(INDEX(Dateneingabe!$E$17:$E$166,LARGE((Dateneingabe!$D$17:$D$166=$D$12)*(ROW(Dateneingabe!$D$17:$D$166)-16),COUNTIF(Dateneingabe!$D$17:$D$166,$D$12)+17-ROW(Dateneingabe!D23))),\"\")","v":""}]
[null,"Wohneinheit:",null,null,null,null,null,null,null,null,null,null,null,null,null,null,null,null,null,null,null,null,null,null,null,null,null,null,null,null,null,null,null,null,null,null,null,null,null,null,null,null,null,null,null,null,null,null,null,null,null,null,null,null,null,null,null,null,null,null,null,null,null,null,null,null,null,null,null,null,null,null,null,null,null,null,null,null,null,null,null,{"$f":"IFERROR(INDEX(Dateneingabe!$E$17:$E$166,LARGE((Dateneingabe!$D$17:$D$166=$D$12)*(ROW(Dateneingabe!$D$17:$D$166)-16),COUNTIF(Dateneingabe!$D$17:$D$166,$D$12)+17-ROW(Dateneingabe!D24))),\"\")","v":""}]
[null,null,null,null,null,null,null,null,null,null,null,null,null,null,null,null,null,null,null,null,null,null,null,null,null,null,null,null,null,null,null,null,null,null,null,null,null,null,null,null,null,null,null,null,null,null,null,null,null,null,null,null,null,null,null,null,null,null,null,null,null,null,null,null,null,null,null,null,null,null,null,null,null,null,null,null,null,null,null,null,null,{"$f":"IFERROR(INDEX(Dateneingabe!$E$17:$E$166,LARGE((Dateneingabe!$D$17:$D$166=$D$12)*(ROW(Dateneingabe!$D$17:$D$166)-16),COUNTIF(Dateneingabe!$D$17:$D$166,$D$12)+17-ROW(Dateneingabe!D25))),\"\")","v":""}]
[null,"Name:",null,"",null,null,null,"Kontakt:",null,null,null,null,null,"Gesamtkosten der Wärmeversorgung",null,null,null,null,null,null,null,null,null,null,null,null,null,null,null,null,null,null,null,null,null,null,null,null,null,null,null,null,null,null,null,null,null,null,null,null,null,null,null,null,null,null,null,null,null,null,null,null,null,null,null,null,null,null,null,null,null,null,null,null,null,null,null,null,null,null,null,{"$f":"IFERROR(INDEX(Dateneingabe!$E$17:$E$166,LARGE((Dateneingabe!$D$17:$D$166=$D$12)*(ROW(Dateneingabe!$D$17:$D$166)-16),COUNTIF(Dateneingabe!$D$17:$D$166,$D$12)+17-ROW(Dateneingabe!D26))),\"\")","v":""}]
[null,"Straße:",null,null,null,null,null,null,null,null,null,null,null,null,null,null,null,null,null,null,null,null,null,null,null,null,null,null,null,null,null,null,null,null,null,null,null,null,null,null,null,null,null,null,null,null,null,null,null,null,null,null,null,null,null,null,null,null,null,null,null,null,null,null,null,null,null,null,null,null,null,null,null,null,null,null,null,null,null,null,null,{"$f":"IFERROR(INDEX(Dateneingabe!$E$17:$E$166,LARGE((Dateneingabe!$D$17:$D$166=$D$12)*(ROW(Dateneingabe!$D$17:$D$166)-16),COUNTIF(Dateneingabe!$D$17:$D$166,$D$12)+17-ROW(Dateneingabe!D27))),\"\")","v":""}]
{"$rows_left_out":58}
{"sheet":"Haftungsausschluss","index":2,"n_rows":2,"n_cols":2,"rows_kept":2,"cut":false,"hidden":false,"merged":[[1,1,12,8]]}
[]
[null,"Haftungsausschluss für das Berechnungsprogramm\n\nAlle Inhalte wurden von uns mit allergrößter Sorgfalt erstellt. Das DEPI-Berechnungstool zur Heizkostenabrechnung muss von den Nutzern auf ihren konkreten Einzelfall angepasst werden. Wir übernehmen ausdrücklich keine Gewähr für die Vollständigkeit, Richtigkeit und Aktualität des angebotenen Inhalts oder die Richtigkeit der Ergebnisse, die durch die Berechnung mit unserem Berechnungstool entstehen. Bitte prüfen Sie in Ihrem eigenen Interesse, ob die Berechnungen plausibel sind. Wir übernehmen keine Haftung für Schäden oder wirtschaftliche Nachteile jeglicher Art, die durch die Nutzung des Berechnungstool entstehen."]